{"text_format":"1","workbook":"xlsx","n_sheets":17,"sheets":["User's instructions","Data Input","Data","ES-Indic","ES-Scores","ES-Synth table","Outcomes","Profile","colors","Dimension (FR)","Dimension (UK)","Dimension Outcomes","Scoring","Methodology","DimOutput","DimIndic","DimPillar"],"not_rendered":{"charts":12,"images":4,"macros":1,"external_links":0,"defined_names":16,"comments":0,"pivot_tables":0},"unopened":[],"bounds":{"document_bytes":16777216,"sheet_cells":100000,"rows_first":2000,"rows_last":500,"rows_between":2000,"halvings":0,"cell_chars":16384,"cell_head_chars":4096},"cells_cut":0,"cells_raw":0,"read":"whole","date_system":"1900"}

{"sheet":"User's instructions","index":0,"n_rows":39,"n_cols":3,"rows_kept":39,"cut":false,"hidden":false,"merged":[]}
[]
[null,null,"1. Unblock the Excel file after downloading the Excel file from the Internet"]
[]
[]
[]
[]
{"$rows_left_out":34}
{"sheet":"Data Input","index":1,"n_rows":52,"n_cols":17,"rows_kept":52,"cut":false,"hidden":false,"merged":[[3,7,4,7]]}
[]
[null,null,null,null,{"$f":"Profile!E2","v":"Team leader"},null,null,null,null,null,null,null,null,"PEFA CLIMATE ASSESSMENT "]
[null,null,null,null,{"$f":"Profile!E3","v":"Country"},"Pefalia"]
[null,null,null,null,{"$f":"Profile!E4","v":"Year of assessment"},2021]
[]
[null,null,null,null,null,"Global score",{"$f":"IFERROR(AVERAGEIFS(J12:J36,$D12:$D36,\"Indic\",J12:J36,\">0\"),0)","v":1.25},{"$f":"AVERAGEIFS(K12:K36,$D12:$D36,\"Indic\",K12:K36,\">0\")","v":1.2142857142857142}]
{"$rows_left_out":47}
{"sheet":"Data","index":2,"n_rows":44,"n_cols":21,"rows_kept":44,"cut":false,"hidden":true,"merged":[]}
["Country","Fmk","Year","Period","Type","ID","ID_Ind_Num","ID-Ind","ID_Comp","Method","ID_Pilar","Pilar","Label","Score","Score Num","Performance","AVG Num","Min Num","Min NumC","Score PEFA","Justification"]
[{"$f":"'Data Input'!$F$3","v":"Pefalia"},"Climat",{"$f":"'Data Input'!$F$4","v":2021},"Current","Indic",1,1,{"$f":"\"CRPFM-\"&G2","v":"CRPFM-1"},null,"M2",null,null,null,{"$f":"IF($D2=\"Current\",VLOOKUP(F2,'Data Input'!$B$9:$N$52,7,FALSE),VLOOKUP(F2,'Data Input'!$B$9:$N$52,6,FALSE))","v":"B"},{"$f":"IFERROR(IF($B2=\"Climat\",IF($D2=\"Current\",VLOOKUP($F2,'Data Input'!$B$9:$N$52,10,FALSE),VLOOKUP($F2,'Data Input'!$B$9:$N$52,9,FALSE)),IF($D2=\"Current\",VLOOKUP($F2,'Data Input'!$B$12:$N$53,10,FALSE),VLOOKUP($F2,'Data Input'!$B$12:$N$53,9,FALSE))),\"\")","v":3},{"$f":"IF(O2>=3.25,\"4. HIGH\",\nIF(O2>=3,\"3. SOUND\",\nIF(O2>=2,\"2. BASIC\",\nIF(O2>=1,\"1. BELOW BASIC\",\n\"\"\n))))","v":"3. SOUND"},{"$f":"IFERROR(AVERAGEIFS($O$2:$O$44,$B$2:$B$44,$B2,$G$2:$G$44,$G2,$C$2:$C$44,$C2,$E$2:$E$44,\"Comp\",$O$2:$O$44,\">0\"),0)","v":3},{"$f":"MIN(IF($O$2:$O$45>0,IF($B$2:$B$45=$B2,IF($C$2:$C$45=$C2,IF($H$2:$H$45=$H2,$O$2:$O$45)))))","v":3},{"$f":"IF($Q2=$R2,$Q2,$R2+0.5)","v":3},{"$f":"(IF($J2=\"M1\",$S2,$Q2))","v":3}]
[{"$f":"'Data Input'!$F$3","v":"Pefalia"},"Climat",{"$f":"'Data Input'!$F$4","v":2021},"Current","Comp",1.1000000000000001,1,{"$f":"\"CRPFM-\"&G3","v":"CRPFM-1"},1,null,{"$f":"VLOOKUP($F3,'Dimension (FR)'!$A$2:$G$52,5,FALSE)","v":"1 - Alignement du budget sur les stratégies climat"},{"$f":"VLOOKUP($F3,'Dimension (FR)'!$A$2:$G$52,6,FALSE)","v":"IV"},{"$f":"VLOOKUP($F3,'Dimension (FR)'!$A$2:$G$52,2,FALSE)","v":1.1000000000000001},{"$f":"IF($B3=\"Climat\",IF($D3=\"Current\",VLOOKUP($F3,'Data Input'!$B$9:$N$52,7,FALSE),VLOOKUP($F3,'Data Input'!$B$9:$N$52,6,FALSE)),IF($D3=\"Current\",VLOOKUP($F3,'Data Input'!$B$12:$N$53,7,FALSE),VLOOKUP($F3,'Data Input'!$B$12:$N$53,6,FALSE)))","v":"B"},{"$f":"IFERROR(IF($B3=\"Climat\",IF($D3=\"Current\",VLOOKUP($F3,'Data Input'!$B$9:$N$52,10,FALSE),VLOOKUP($F3,'Data Input'!$B$9:$N$52,9,FALSE)),IF($D3=\"Current\",VLOOKUP($F3,'Data Input'!$B$12:$N$53,10,FALSE),VLOOKUP($F3,'Data Input'!$B$12:$N$53,9,FALSE))),\"\")","v":3},"3. SOUND",3,{"$f":"MIN(IF($O$2:$O$45>0,IF($B$2:$B$45=$B3,IF($C$2:$C$45=$C3,IF($H$2:$H$45=$H3,$O$2:$O$45)))))","v":3},3,3,{"$f":"IF($D3=\"Current\",VLOOKUP($F3,'Data Input'!$B$9:$N$52,12,FALSE),\"\")","v":""}]
[{"$f":"'Data Input'!$F$3","v":"Pefalia"},"Climat",{"$f":"'Data Input'!$F$4","v":2021},"Current","Indic",2,2,"CRPFM-2",null,"M2",null,null,null,{"$f":"IF($D4=\"Current\",VLOOKUP(F4,'Data Input'!$B$9:$N$52,7,FALSE),VLOOKUP(F4,'Data Input'!$B$9:$N$52,6,FALSE))","v":"D"},{"$f":"IFERROR(IF($B4=\"Climat\",IF($D4=\"Current\",VLOOKUP($F4,'Data Input'!$B$9:$N$52,10,FALSE),VLOOKUP($F4,'Data Input'!$B$9:$N$52,9,FALSE)),IF($D4=\"Current\",VLOOKUP($F4,'Data Input'!$B$12:$N$53,10,FALSE),VLOOKUP($F4,'Data Input'!$B$12:$N$53,9,FALSE))),\"\")","v":1},"1. BELOW BASIC",1,{"$f":"MIN(IF($O$2:$O$45>0,IF($B$2:$B$45=$B4,IF($C$2:$C$45=$C4,IF($H$2:$H$45=$H4,$O$2:$O$45)))))","v":1},1,1]
[{"$f":"'Data Input'!$F$3","v":"Pefalia"},"Climat",{"$f":"'Data Input'!$F$4","v":2021},"Current","Comp",2.1,2,"CRPFM-2",1,null,{"$f":"VLOOKUP($F5,'Dimension (FR)'!$A$2:$G$52,5,FALSE)","v":"2 - Suivi des dépenses liées au climat"},{"$f":"VLOOKUP($F5,'Dimension (FR)'!$A$2:$G$52,6,FALSE)","v":"II"},{"$f":"VLOOKUP($F5,'Dimension (FR)'!$A$2:$G$52,2,FALSE)","v":2.1},{"$f":"IF($B5=\"Climat\",IF($D5=\"Current\",VLOOKUP($F5,'Data Input'!$B$9:$N$52,7,FALSE),VLOOKUP($F5,'Data Input'!$B$9:$N$52,6,FALSE)),IF($D5=\"Current\",VLOOKUP($F5,'Data Input'!$B$12:$N$53,7,FALSE),VLOOKUP($F5,'Data Input'!$B$12:$N$53,6,FALSE)))","v":"D"},{"$f":"IFERROR(IF($B5=\"Climat\",IF($D5=\"Current\",VLOOKUP($F5,'Data Input'!$B$9:$N$52,10,FALSE),VLOOKUP($F5,'Data Input'!$B$9:$N$52,9,FALSE)),IF($D5=\"Current\",VLOOKUP($F5,'Data Input'!$B$12:$N$53,10,FALSE),VLOOKUP($F5,'Data Input'!$B$12:$N$53,9,FALSE))),\"\")","v":1},"1. BELOW BASIC",1,{"$f":"MIN(IF($O$2:$O$45>0,IF($B$2:$B$45=$B5,IF($C$2:$C$45=$C5,IF($H$2:$H$45=$H5,$O$2:$O$45)))))","v":1},1,1,{"$f":"IF($D5=\"Current\",VLOOKUP($F5,'Data Input'!$B$9:$N$52,12,FALSE),\"\")","v":""}]
[{"$f":"'Data Input'!$F$3","v":"Pefalia"},"Climat",{"$f":"'Data Input'!$F$4","v":2021},"Current","Indic",3,3,"CRPFM-3",null,"M2",null,null,null,{"$f":"IF($D6=\"Current\",VLOOKUP(F6,'Data Input'!$B$9:$N$52,7,FALSE),VLOOKUP(F6,'Data Input'!$B$9:$N$52,6,FALSE))","v":"D"},{"$f":"IFERROR(IF($B6=\"Climat\",IF($D6=\"Current\",VLOOKUP($F6,'Data Input'!$B$9:$N$52,10,FALSE),VLOOKUP($F6,'Data Input'!$B$9:$N$52,9,FALSE)),IF($D6=\"Current\",VLOOKUP($F6,'Data Input'!$B$12:$N$53,10,FALSE),VLOOKUP($F6,'Data Input'!$B$12:$N$53,9,FALSE))),\"\")","v":1},"1. BELOW BASIC",1,{"$f":"MIN(IF($O$2:$O$45>0,IF($B$2:$B$45=$B6,IF($C$2:$C$45=$C6,IF($H$2:$H$45=$H6,$O$2:$O$45)))))","v":1},1,1]
{"$rows_left_out":39}
{"sheet":"ES-Indic","index":3,"n_rows":191,"n_cols":38,"rows_kept":191,"cut":false,"hidden":false,"merged":[]}
[null,null,null,null,null,null,null,null,null,null,null,null,null,null,null,null,null,null,null,null,null,null,null,"Indic","Indic","Indic"]
[null,null,null,null,null,null,null,null,null,null,null,null,null,null,null,null,null,null,null,null,null,null,null,"AD","AD","AD",null,null,null,null,null,null,null,null,null,null,null,"AD"]
[]
[null,null,null,null,null,null,null,null,null,null,null,null,null,null,null,null,null,null,null,null,null,null,null,null,null,null,null,null,null,4,0,"A"]
[null,null,null,null,null,null,null,null,null,null,null,null,null,null,null,null,null,null,null,null,null,null,null,null,null,null,null,null,null,3.5,0,"B+"]
[null,null,null,null,null,null,null,null,null,null,null,null,null,null,null,null,null,null,null,null,null,null,null,null,null,null,null,null,null,3,0,"B+"]
{"$rows_left_out":186}
{"sheet":"ES-Scores","index":4,"n_rows":58,"n_cols":4,"rows_kept":58,"cut":false,"hidden":false,"merged":[]}
[]
[]
[null,"ID-Ind",{"$f":"'Data Input'!$G$9","v":" "},{"$f":"'Data Input'!$H$9","v":2021}]
[null,"A",{"$f":"COUNTIFS('Data Input'!$D$12:$D$49,\"Indic\",'Data Input'!$G$12:$G$49,\"A\")","v":0},{"$f":"COUNTIFS('Data Input'!$D$10:$D$54,\"Indic\",'Data Input'!$H$10:$H$54,\"A\")","v":0}]
[null,"B+",{"$f":"COUNTIFS('Data Input'!$D$12:$D$49,\"Indic\",'Data Input'!$G$12:$G$49,\"B+\")","v":0},{"$f":"COUNTIFS('Data Input'!$D$10:$D$54,\"Indic\",'Data Input'!$H$10:$H$54,\"B+\")","v":0}]
[null,"B",{"$f":"COUNTIFS('Data Input'!$D$12:$D$49,\"Indic\",'Data Input'!$G$12:$G$49,\"B\")","v":0},{"$f":"COUNTIFS('Data Input'!$D$10:$D$54,\"Indic\",'Data Input'!$H$10:$H$54,\"B\")","v":1}]
{"$rows_left_out":53}
{"sheet":"ES-Synth table","index":5,"n_rows":17,"n_cols":11,"rows_kept":17,"cut":false,"hidden":false,"merged":[]}
[null,null,null,null,{"$f":"\"PEFA climat \"&'Data Input'!F3&\" - Year \"&'Data Input'!F4","v":"PEFA climat Pefalia - Year 2021"}]
[]
["M2",null,"Performance Indicator ",null," Indicator",1,2,3,4,null," "]
["Method",null,1,{"$f":"\"CRPFM-\"&C4","v":"CRPFM-1"},{"$f":"VLOOKUP(C4,'Dimension (UK)'!$A$2:$C$52,3,FALSE)","v":"1 Budget alignment with climate change strategies "},{"$f":"_xlfn.IFNA(INDEX(Data!$N$2:$N$44, MATCH(1,(F$3=Data!$I$2:$I$44)*($C4=Data!$G$2:$G$44), 0)),\"\")","v":"B"},{"$f":"_xlfn.IFNA(INDEX(Data!$N$2:$N$44, MATCH(1,(G$3=Data!$I$2:$I$44)*($C4=Data!$G$2:$G$44), 0)),\"\")","v":""},{"$f":"_xlfn.IFNA(INDEX(Data!$N$2:$N$44, MATCH(1,(H$3=Data!$I$2:$I$44)*($C4=Data!$G$2:$G$44), 0)),\"\")","v":""},{"$f":"_xlfn.IFNA(INDEX(Data!$N$2:$N$44, MATCH(1,(I$3=Data!$I$2:$I$44)*($C4=Data!$G$2:$G$44), 0)),\"\")","v":""},{"$f":"_xlfn.IFNA(INDEX(Data!$N$2:$N$44, MATCH(1,(J$3=Data!$I$2:$I$44)*($C4=Data!$G$2:$G$44), 0)),\"\")","v":"B"}]
["M2",null,2,"CRPFM-2",{"$f":"VLOOKUP(C5,'Dimension (UK)'!$A$2:$C$52,3,FALSE)","v":"2 Tracking climate related expenditure"},{"$f":"_xlfn.IFNA(INDEX(Data!$N$2:$N$44, MATCH(1,(F$3=Data!$I$2:$I$44)*($C5=Data!$G$2:$G$44), 0)),\"\")","v":"D"},{"$f":"_xlfn.IFNA(INDEX(Data!$N$2:$N$44, MATCH(1,(G$3=Data!$I$2:$I$44)*($C5=Data!$G$2:$G$44), 0)),\"\")","v":""},{"$f":"_xlfn.IFNA(INDEX(Data!$N$2:$N$44, MATCH(1,(H$3=Data!$I$2:$I$44)*($C5=Data!$G$2:$G$44), 0)),\"\")","v":""},{"$f":"_xlfn.IFNA(INDEX(Data!$N$2:$N$44, MATCH(1,(I$3=Data!$I$2:$I$44)*($C5=Data!$G$2:$G$44), 0)),\"\")","v":""},{"$f":"_xlfn.IFNA(INDEX(Data!$N$2:$N$44, MATCH(1,(J$3=Data!$I$2:$I$44)*($C5=Data!$G$2:$G$44), 0)),\"\")","v":"D"}]
["M2",null,3,"CRPFM-3",{"$f":"VLOOKUP(C6,'Dimension (UK)'!$A$2:$C$52,3,FALSE)","v":"3 Climate responsive budget circular "},{"$f":"_xlfn.IFNA(INDEX(Data!$N$2:$N$44, MATCH(1,(F$3=Data!$I$2:$I$44)*($C6=Data!$G$2:$G$44), 0)),\"\")","v":"D"},{"$f":"_xlfn.IFNA(INDEX(Data!$N$2:$N$44, MATCH(1,(G$3=Data!$I$2:$I$44)*($C6=Data!$G$2:$G$44), 0)),\"\")","v":""},{"$f":"_xlfn.IFNA(INDEX(Data!$N$2:$N$44, MATCH(1,(H$3=Data!$I$2:$I$44)*($C6=Data!$G$2:$G$44), 0)),\"\")","v":""},{"$f":"_xlfn.IFNA(INDEX(Data!$N$2:$N$44, MATCH(1,(I$3=Data!$I$2:$I$44)*($C6=Data!$G$2:$G$44), 0)),\"\")","v":""},{"$f":"_xlfn.IFNA(INDEX(Data!$N$2:$N$44, MATCH(1,(J$3=Data!$I$2:$I$44)*($C6=Data!$G$2:$G$44), 0)),\"\")","v":"D"}]
{"$rows_left_out":12}
{"sheet":"Outcomes","index":6,"n_rows":46,"n_cols":40,"rows_kept":46,"cut":false,"hidden":false,"merged":[]}
[]
[null,null,null,null,null,null,null,null,null,null,null,null,"Indicator score ranking by Outcome",null,null,null,null,null,null,null,null,null,null,null,"AL",null,null,null,null,null,null,null,null,null,null,null,null,"AL"]
[null,null,null,null,null,null,null,null,null,null,null,null,null,null,null,null,null,null,null,null,null,null,null,null,null,null,null,null,null,null,null,null,null,null,null,null,null,4,0,"A"]
[null,null,null,null,null,null,null,null,null,null,null,null,null,null,null,null,null,null,null,null,null,null,null,null,null,null,null,null,null,null,null,null,null,null,null,null,null,3.5,0,"B+"]
[null,null,null,null,null,null,null,null,null,null,null,null,null,null,null,null,null,null,null,null,null,null,null,null,null,null,null,null,null,null,null,null,null,null,null,null,null,3,0,"B+"]
[null,null,null,null,null,null,null,null,null,null,null,null,null,null,null,null,null,null,null,null,null,null,null,null,null,null,null,null,null,null,null,null,null,null,null,null,null,2.5,0,"C+"]
{"$rows_left_out":41}
{"sheet":"Profile","index":7,"n_rows":111,"n_cols":26,"rows_kept":111,"cut":false,"hidden":true,"merged":[]}
["Years",null,"Score ","Comp","Meta"]
[2000,null,"A","Yes","Team leader"]
[2001,null,"B","No","Country"]
[2002,null,"C",null,"Year of assessment"]
[2003,null,"D"]
[2004,null,"D*"]
{"$rows_left_out":106}
{"sheet":"colors","index":8,"n_rows":22,"n_cols":11,"rows_kept":22,"cut":false,"hidden":true,"merged":[]}
[1,"ELEMENTAIRE","Sec!Pefa2018",null,"Sheets with Charts with numeric data labels data",null,"Sheets with tables"]
[2,"BASIQUE",null,null,"ES-Indic",null,"Sheet Name","Numeric Data Labels?","Start row","Start Column","Column used to find last row"]
[3,"3. Suffisant",null,null,null,null,"ES-Synth table","N",3,3,3]
[4,"Avancé"]
[]
[]
{"$rows_left_out":17}
{"sheet":"Dimension (FR)","index":9,"n_rows":44,"n_cols":7,"rows_kept":44,"cut":false,"hidden":true,"merged":[]}
["ID","ID-Dim3","Dimension Niv 3","ID-Dim2","Dimension Niv 2","ID-Dim1","Dimension Niv 1"]
[1.1000000000000001,1.1000000000000001,"1.1. Alignement du budget sur les stratégies de lutte contre le changement climatique  ",1,"1 - Alignement du budget sur les stratégies climat",{"$f":"VLOOKUP($A2,DimPillar!$A$2:$C$30,2,FALSE)","v":"IV"}," Stratégie budgétaire et budgétisation fondées sur des politiques "]
[2.1,2.1,"2.1. Suivi des dépenses liées au climat  ",2,"2 - Suivi des dépenses liées au climat",{"$f":"VLOOKUP($A3,DimPillar!$A$2:$C$30,2,FALSE)","v":"II"}," Transparence "]
[3.1,3.1,"3.1. Circulaire budgétaire",3,"3 - Circulaire budgétaire sensible au climat",{"$f":"VLOOKUP($A4,DimPillar!$A$2:$C$30,2,FALSE)","v":"IV"}," Stratégie budgétaire et budgétisation fondées sur les politiques publiques "]
[4.0999999999999996,4.0999999999999996,"4.1. Contrôle législatif des budgets",4,"4 - Examen par le pouvoir législatif",{"$f":"VLOOKUP($A5,DimPillar!$A$2:$C$30,2,FALSE)","v":"IV"}," Stratégie budgétaire et budgétisation fondées sur des politiques "]
[4.2,4.2,"4.2. Examen législatif des rapports d'audit et d'évaluation",4,"4 - Examen par le pouvoir législatif",{"$f":"VLOOKUP($A6,DimPillar!$A$2:$C$30,2,FALSE)","v":"VII"}," Contrôle et audit externes "]
{"$rows_left_out":39}
{"sheet":"Dimension (UK)","index":10,"n_rows":44,"n_cols":7,"rows_kept":44,"cut":false,"hidden":true,"merged":[]}
["ID","ID-Dim3","Dimension Niv 3","ID-Dim2","Dimension Niv 2","ID-Dim1","Dimension Niv 1"]
[1.1000000000000001,1.1000000000000001,"1.1 Budget alignment with climate change strategies",1,{"$f":"VLOOKUP(D2,DimIndic!$A$2:$B$15,2,FALSE)","v":"1 Budget alignment with climate change strategies "},{"$f":"VLOOKUP($A2,DimPillar!$A$2:$C$30,2,FALSE)","v":"IV"},{"$f":"VLOOKUP($A2,DimPillar!$A$2:$C$30,3,FALSE)","v":" Policy-based fiscal strategy and budgeting "}]
[2.1,2.1,"2.1 Tracking climate related expenditure",2,{"$f":"VLOOKUP(D3,DimIndic!$A$2:$B$15,2,FALSE)","v":"2 Tracking climate related expenditure"},{"$f":"VLOOKUP($A3,DimPillar!$A$2:$C$30,2,FALSE)","v":"II"},{"$f":"VLOOKUP($A3,DimPillar!$A$2:$C$30,3,FALSE)","v":" Transparency "}]
[3.1,3.1,"3.1 Budget circular",3,{"$f":"VLOOKUP(D4,DimIndic!$A$2:$B$15,2,FALSE)","v":"3 Climate responsive budget circular "},{"$f":"VLOOKUP($A4,DimPillar!$A$2:$C$30,2,FALSE)","v":"IV"},{"$f":"VLOOKUP($A4,DimPillar!$A$2:$C$30,3,FALSE)","v":" Policy-based fiscal strategy and budgeting "}]
[4.0999999999999996,4.0999999999999996,"4.1 Legislative scrutiny of budget",4,{"$f":"VLOOKUP(D5,DimIndic!$A$2:$B$15,2,FALSE)","v":"4 Legislative scrutiny"},{"$f":"VLOOKUP($A5,DimPillar!$A$2:$C$30,2,FALSE)","v":"IV"},{"$f":"VLOOKUP($A5,DimPillar!$A$2:$C$30,3,FALSE)","v":" Policy-based fiscal strategy and budgeting "}]
[4.2,4.2,"4.2 Legislative scrutiny of audit and evaluation reports",4,{"$f":"VLOOKUP(D6,DimIndic!$A$2:$B$15,2,FALSE)","v":"4 Legislative scrutiny"},{"$f":"VLOOKUP($A6,DimPillar!$A$2:$C$30,2,FALSE)","v":"VII"},{"$f":"VLOOKUP($A6,DimPillar!$A$2:$C$30,3,FALSE)","v":" External scrutiny and audit "}]
{"$rows_left_out":39}
{"sheet":"Dimension Outcomes","index":11,"n_rows":37,"n_cols":5,"rows_kept":37,"cut":false,"hidden":true,"merged":[]}
["Outcome","PEFA Climate Indicator ","Component","Column1","Column2"]
["Aggregate fiscal discipline ","CRPFM–10 Compliance of climate related expenditure ",10.199999999999999,{"$f":"VLOOKUP(Table1_2[[#This Row],[Component]],'Data Input'!$B:$N,12,FALSE)","v":""},{"$f":"VLOOKUP(Table1_2[[#This Row],[Component]],'Data Input'!$B:$N,10,FALSE)","v":3}]
["Aggregate fiscal discipline ","CRPFM–10 Compliance of climate related expenditure ",10.1,{"$f":"VLOOKUP(Table1_2[[#This Row],[Component]],'Data Input'!$B:$N,12,FALSE)","v":""},{"$f":"VLOOKUP(Table1_2[[#This Row],[Component]],'Data Input'!$B:$N,10,FALSE)","v":2}]
["Aggregate fiscal discipline ","CRPFM–1 Budget alignment with climate change strategies  ",1.1000000000000001,{"$f":"VLOOKUP(Table1_2[[#This Row],[Component]],'Data Input'!$B:$N,12,FALSE)","v":""},{"$f":"VLOOKUP(Table1_2[[#This Row],[Component]],'Data Input'!$B:$N,10,FALSE)","v":3}]
["Efficient service delivery ","CRPFM-9 Climate responsive revenue administration ",9.1999999999999993,{"$f":"VLOOKUP(Table1_2[[#This Row],[Component]],'Data Input'!$B:$N,12,FALSE)","v":""},{"$f":"VLOOKUP(Table1_2[[#This Row],[Component]],'Data Input'!$B:$N,10,FALSE)","v":0}]
["Efficient service delivery ","CRPFM-13 Climate related performance evaluation ",13.1,{"$f":"VLOOKUP(Table1_2[[#This Row],[Component]],'Data Input'!$B:$N,12,FALSE)","v":""},{"$f":"VLOOKUP(Table1_2[[#This Row],[Component]],'Data Input'!$B:$N,10,FALSE)","v":1}]
{"$rows_left_out":32}
{"sheet":"Scoring","index":12,"n_rows":120,"n_cols":5,"rows_kept":120,"cut":false,"hidden":true,"merged":[]}
["ID","Score","Justification"]
[1.1000000000000001,"A","The system in place fulfills 8 elements, including at least 4 basic elements (1-6). "]
[1.1000000000000001,"B","The system in place fulfills 6 elements, including at least 3 basic elements (1-6). "]
[1.1000000000000001,"C","The system in place fulfills at least 3 basic elements (1-6). "]
[1.1000000000000001,"D","Performance is less than required for a C score.  "]
[2.1,"A","The system in place to track climate related expenditure fulfills 7 elements, including Element 1 and at least 3 other basic elements (2-5). "]
{"$rows_left_out":115}
{"sheet":"Methodology","index":13,"n_rows":113,"n_cols":3,"rows_kept":113,"cut":false,"hidden":true,"merged":[]}
["Indicator","Score","Justification"]
["CRPFM—1.1. BUDGET ALIGNMENT WITH CLIMATE CHANGE STRATEGIES  ","A","The system in place fulfills 8 elements, including at least 4 basic elements (1-6). "]
[null,"B","The system in place fulfills 6 elements, including at least 3 basic elements (1-6). "]
[null,"C","The system in place fulfills at least 3 basic elements (1-6). "]
[null,"D","Performance is less than required for a C score.  "]
["CRPFM—2.1. TRACKING CLIMATE RELATED EXPENDITURE  ","A","The system in place to track climate related expenditure fulfills 7 elements, including Element 1 and at least 3 other basic elements (2-5). "]
{"$rows_left_out":108}
{"sheet":"DimOutput","index":14,"n_rows":35,"n_cols":4,"rows_kept":35,"cut":false,"hidden":true,"merged":[]}
["Dimension ","ID-Indic","ID-Output","Output"]
[1.1000000000000001,1,"O-1","Aggregate fiscal discipline"]
[5.0999999999999996,5,"O-1","Aggregate fiscal discipline"]
[6.1,6,"O-1","Aggregate fiscal discipline"]
[7.1,7,"O-1","Aggregate fiscal discipline"]
[7.2,7,"O-1","Aggregate fiscal discipline"]
{"$rows_left_out":30}
{"sheet":"DimIndic","index":15,"n_rows":15,"n_cols":2,"rows_kept":15,"cut":false,"hidden":true,"merged":[]}
["ID-Indic","Indicator"]
[1,"1 Budget alignment with climate change strategies "]
[2,"2 Tracking climate related expenditure"]
[3,"3 Climate responsive budget circular "]
[4,"4 Legislative scrutiny"]
[5,"5 Climate responsive public investment management"]
{"$rows_left_out":10}
{"sheet":"DimPillar","index":16,"n_rows":30,"n_cols":3,"rows_kept":30,"cut":false,"hidden":true,"merged":[]}
["Dimension ","ID_Pilar","Pilar"]
[1.1000000000000001,"IV"," Policy-based fiscal strategy and budgeting "]
[3.1,"IV"," Policy-based fiscal strategy and budgeting "]
[4.0999999999999996,"IV"," Policy-based fiscal strategy and budgeting "]
[2.1,"II"," Transparency "]
[11.1,"II"," Transparency "]
{"$rows_left_out":24}